OESF | ELSI | pdaXrom | OpenZaurus | Zaurus Themes | Community Links | Ibiblio

IPB

Welcome Guest ( Log In | Register )

Profile
Personal Photo
Options
Options
Personal Statement
bowerymarc doesn't have a personal statement currently.
Personal Info
bowerymarc
Age Unknown
Gender Not Set
Location Unknown
Birthday Unknown
Interests
No Information
Statistics
Joined: 12-July 06
Profile Views: 364*
Last Seen: 4th December 2006 - 10:48 AM
Local Time: Sep 18 2014, 05:49 PM
2 posts (0 per day)
Contact Information
AIM No Information
Yahoo No Information
ICQ No Information
MSN No Information
* Profile views updated each hour

bowerymarc

Members


Topics
Posts
Comments
Friends
My Content
13 Jul 2006
Trying to build gpe-image (building nano worked) after following the wiki instructions.. help!

[marc@localhost build]$ bitbake gpe-image
NOTE: Using cache in '/home/marc/openEmbedded/build/tmp/cache'
NOTE: Parsing finished. 3422 cached, 0 parsed, 124 skipped, 0 masked.
NOTE: build 200607131546: started

OE Build Configuration:
BB_VERSION = "1.4.3"
OE_REVISION = "85921202b8fd4be54741cadc9cbf9c3768a9b23a"
TARGET_ARCH = "arm"
TARGET_OS = "linux"
MACHINE = "ep93xx"
DISTRO = "generic"
DISTRO_VERSION = ".dev-snapshot-20060713"
TARGET_FPU = "soft"

NOTE: multiple providers are available (glibc, glibc-intermediate);
NOTE: consider defining PREFERRED_PROVIDER_virtual/arm-linux-libc-for-gcc
NOTE:
NOTE: multiple providers are available (libx11, diet-x11);
NOTE: consider defining PREFERRED_PROVIDER_x11
NOTE:
NOTE: package libx11-X11R7.1-1.0.1: started
NOTE: package libx11-X11R7.1-1.0.1-r0: task do_fetch: started
NOTE: package libx11-X11R7.1-1.0.1-r0: task do_fetch: completed
NOTE: package libx11-X11R7.1-1.0.1-r0: task do_compile: started
ERROR: function do_compile failed
ERROR: log data follows (/home/marc/openEmbedded/build/tmp/work/arm-linux/libx11-X11R7.1-1.0.1-r0/temp/log.do_compile.19077)
| NOTE: make -C src/util CC=gcc LD=ld CXX=g++ CCLD=gcc CFLAGS=-D_GNU_SOURCE -isystem/home/marc/openEmbedded/build/tmp/staging/i686-linux/include -O2 LDFLAGS=-L/home/marc/openEmbedded/build/tmp/staging/i686-linux/lib -Wl,-rpath-link,/home/marc/openEmbedded/build/tmp/staging/i686-linux/lib -Wl,-rpath,/home/marc/openEmbedded/build/tmp/staging/i686-linux/lib -Wl,-O1 CXXFLAGS=-isystem/home/marc/openEmbedded/build/tmp/staging/i686-linux/include -O2 -fpermissive CPPFLAGS=-isystem/home/marc/openEmbedded/build/tmp/staging/i686-linux/include makekeys
| make: Entering directory `/home/marc/openEmbedded/build/tmp/work/arm-linux/libx11-X11R7.1-1.0.1-r0/libX11-X11R7.1-1.0.1/src/util'
| make: `makekeys' is up to date.
| make: Leaving directory `/home/marc/openEmbedded/build/tmp/work/arm-linux/libx11-X11R7.1-1.0.1-r0/libX11-X11R7.1-1.0.1/src/util'
| NOTE: make
| Making all in include
| make[1]: Entering directory `/home/marc/openEmbedded/build/tmp/work/arm-linux/libx11-X11R7.1-1.0.1-r0/libX11-X11R7.1-1.0.1/include'
| make[1]: Nothing to be done for `all'.
| make[1]: Leaving directory `/home/marc/openEmbedded/build/tmp/work/arm-linux/libx11-X11R7.1-1.0.1-r0/libX11-X11R7.1-1.0.1/include'
| Making all in modules
| make[1]: Entering directory `/home/marc/openEmbedded/build/tmp/work/arm-linux/libx11-X11R7.1-1.0.1-r0/libX11-X11R7.1-1.0.1/modules'
| Making all in im
| make[2]: Entering directory `/home/marc/openEmbedded/build/tmp/work/arm-linux/libx11-X11R7.1-1.0.1-r0/libX11-X11R7.1-1.0.1/modules/im'
| Making all in ximcp
| make[3]: Entering directory `/home/marc/openEmbedded/build/tmp/work/arm-linux/libx11-X11R7.1-1.0.1-r0/libX11-X11R7.1-1.0.1/modules/im/ximcp'
| if /bin/sh ../../../arm-linux-libtool --tag=CC --mode=compile arm-linux-gcc -march=armv4t -mtune=arm920t -DHAVE_CONFIG_H -I. -I/home/marc/openEmbedded/build/tmp/work/arm-linux/libx11-X11R7.1-1.0.1-r0/libX11-X11R7.1-1.0.1/modules/im/ximcp -I../../../src -I../../../include/X11 -isystem/home/marc/openEmbedded/build/tmp/staging/arm-linux/include -I/home/marc/openEmbedded/build/tmp/work/arm-linux/libx11-X11R7.1-1.0.1-r0/libX11-X11R7.1-1.0.1/include -I/home/marc/openEmbedded/build/tmp/work/arm-linux/libx11-X11R7.1-1.0.1-r0/libX11-X11R7.1-1.0.1/include/X11 -I../../../include -I../../../include/X11 -I/home/marc/openEmbedded/build/tmp/work/arm-linux/libx11-X11R7.1-1.0.1-r0/libX11-X11R7.1-1.0.1/src/xcms -I/home/marc/openEmbedded/build/tmp/work/arm-linux/libx11-X11R7.1-1.0.1-r0/libX11-X11R7.1-1.0.1/src/xkb -I/home/marc/openEmbedded/build/tmp/work/arm-linux/libx11-X11R7.1-1.0.1-r0/libX11-X11R7.1-1.0.1/src/xlibi18n -Wall -Wpointer-arith -Wstrict-prototypes -Wmissing-prototypes -Wmissing-declarations -Wnested-externs -fno-strict-aliasing -D_BSD_SOURCE -DHAS_FCHOWN -DHAS_STICKY_DIR_BIT -I/home/marc/openEmbedded/build/tmp/staging/arm-linux/include -I/home/marc/openEmbedded/build/tmp/staging/arm-linux/include -I/home/marc/openEmbedded/build/tmp/staging/arm-linux/include -I/home/marc/openEmbedded/build/tmp/staging/arm-linux/include -I/home/marc/openEmbedded/build/tmp/staging/arm-linux/include -DHASXDMAUTH -D_BSD_SOURCE -DXIM_t -DTRANS_CLIENT -DMALLOC_0_RETURNS_NULL -isystem/home/marc/openEmbedded/build/tmp/staging/arm-linux/include -fexpensive-optimizations -fomit-frame-pointer -frename-registers -O2 -MT imCallbk.lo -MD -MP -MF ".deps/imCallbk.Tpo" -c -o imCallbk.lo imCallbk.c; \
| then mv -f ".deps/imCallbk.Tpo" ".deps/imCallbk.Plo"; else rm -f ".deps/imCallbk.Tpo"; exit 1; fi
| arm-linux-gcc -march=armv4t -mtune=arm920t -DHAVE_CONFIG_H -I. -I/home/marc/openEmbedded/build/tmp/work/arm-linux/libx11-X11R7.1-1.0.1-r0/libX11-X11R7.1-1.0.1/modules/im/ximcp -I../../../src -I../../../include/X11 -isystem/home/marc/openEmbedded/build/tmp/staging/arm-linux/include -I/home/marc/openEmbedded/build/tmp/work/arm-linux/libx11-X11R7.1-1.0.1-r0/libX11-X11R7.1-1.0.1/include -I/home/marc/openEmbedded/build/tmp/work/arm-linux/libx11-X11R7.1-1.0.1-r0/libX11-X11R7.1-1.0.1/include/X11 -I../../../include -I../../../include/X11 -I/home/marc/openEmbedded/build/tmp/work/arm-linux/libx11-X11R7.1-1.0.1-r0/libX11-X11R7.1-1.0.1/src/xcms -I/home/marc/openEmbedded/build/tmp/work/arm-linux/libx11-X11R7.1-1.0.1-r0/libX11-X11R7.1-1.0.1/src/xkb -I/home/marc/openEmbedded/build/tmp/work/arm-linux/libx11-X11R7.1-1.0.1-r0/libX11-X11R7.1-1.0.1/src/xlibi18n -Wall -Wpointer-arith -Wstrict-prototypes -Wmissing-prototypes -Wmissing-declarations -Wnested-externs -fno-strict-aliasing -D_BSD_SOURCE -DHAS_FCHOWN -DHAS_STICKY_DIR_BIT -I/home/marc/openEmbedded/build/tmp/staging/arm-linux/include -I/home/marc/openEmbedded/build/tmp/staging/arm-linux/include -I/home/marc/openEmbedded/build/tmp/staging/arm-linux/include -I/home/marc/openEmbedded/build/tmp/staging/arm-linux/include -I/home/marc/openEmbedded/build/tmp/staging/arm-linux/include -DHASXDMAUTH -D_BSD_SOURCE -DXIM_t -DTRANS_CLIENT -DMALLOC_0_RETURNS_NULL -isystem/home/marc/openEmbedded/build/tmp/staging/arm-linux/include -fexpensive-optimizations -fomit-frame-pointer -frename-registers -O2 -MT imCallbk.lo -MD -MP -MF .deps/imCallbk.Tpo -c imCallbk.c -fPIC -DPIC -o .libs/imCallbk.o
| In file included from ../../../include/X11/Xlibint.h:43,
| from imCallbk.c:40:
| /home/marc/openEmbedded/build/tmp/work/arm-linux/libx11-X11R7.1-1.0.1-r0/libX11-X11R7.1-1.0.1/include/X11/Xlib.h:3573: error: parse error before "_X_SENTINEL"
| /home/marc/openEmbedded/build/tmp/work/arm-linux/libx11-X11R7.1-1.0.1-r0/libX11-X11R7.1-1.0.1/include/X11/Xlib.h:3573: warning: type defaults to `int' in declaration of `_X_SENTINEL'
| /home/marc/openEmbedded/build/tmp/work/arm-linux/libx11-X11R7.1-1.0.1-r0/libX11-X11R7.1-1.0.1/include/X11/Xlib.h:3573: warning: function declaration isn't a prototype
| /home/marc/openEmbedded/build/tmp/work/arm-linux/libx11-X11R7.1-1.0.1-r0/libX11-X11R7.1-1.0.1/include/X11/Xlib.h:3573: warning: data definition has no type or storage class
| /home/marc/openEmbedded/build/tmp/work/arm-linux/libx11-X11R7.1-1.0.1-r0/libX11-X11R7.1-1.0.1/include/X11/Xlib.h:3578: error: parse error before "_X_SENTINEL"
| /home/marc/openEmbedded/build/tmp/work/arm-linux/libx11-X11R7.1-1.0.1-r0/libX11-X11R7.1-1.0.1/include/X11/Xlib.h:3578: warning: type defaults to `int' in declaration of `_X_SENTINEL'
| /home/marc/openEmbedded/build/tmp/work/arm-linux/libx11-X11R7.1-1.0.1-r0/libX11-X11R7.1-1.0.1/include/X11/Xlib.h:3578: warning: function declaration isn't a prototype
| /home/marc/openEmbedded/build/tmp/work/arm-linux/libx11-X11R7.1-1.0.1-r0/libX11-X11R7.1-1.0.1/include/X11/Xlib.h:3578: warning: data definition has no type or storage class
| /home/marc/openEmbedded/build/tmp/work/arm-linux/libx11-X11R7.1-1.0.1-r0/libX11-X11R7.1-1.0.1/include/X11/Xlib.h:3591: error: parse error before "_X_SENTINEL"
| /home/marc/openEmbedded/build/tmp/work/arm-linux/libx11-X11R7.1-1.0.1-r0/libX11-X11R7.1-1.0.1/include/X11/Xlib.h:3591: warning: type defaults to `int' in declaration of `_X_SENTINEL'
| /home/marc/openEmbedded/build/tmp/work/arm-linux/libx11-X11R7.1-1.0.1-r0/libX11-X11R7.1-1.0.1/include/X11/Xlib.h:3591: warning: function declaration isn't a prototype
| /home/marc/openEmbedded/build/tmp/work/arm-linux/libx11-X11R7.1-1.0.1-r0/libX11-X11R7.1-1.0.1/include/X11/Xlib.h:3591: warning: data definition has no type or storage class
| /home/marc/openEmbedded/build/tmp/work/arm-linux/libx11-X11R7.1-1.0.1-r0/libX11-X11R7.1-1.0.1/include/X11/Xlib.h:3604: error: parse error before "_X_SENTINEL"
| /home/marc/openEmbedded/build/tmp/work/arm-linux/libx11-X11R7.1-1.0.1-r0/libX11-X11R7.1-1.0.1/include/X11/Xlib.h:3604: warning: type defaults to `int' in declaration of `_X_SENTINEL'
| /home/marc/openEmbedded/build/tmp/work/arm-linux/libx11-X11R7.1-1.0.1-r0/libX11-X11R7.1-1.0.1/include/X11/Xlib.h:3604: warning: function declaration isn't a prototype
| /home/marc/openEmbedded/build/tmp/work/arm-linux/libx11-X11R7.1-1.0.1-r0/libX11-X11R7.1-1.0.1/include/X11/Xlib.h:3604: warning: data definition has no type or storage class
| /home/marc/openEmbedded/build/tmp/work/arm-linux/libx11-X11R7.1-1.0.1-r0/libX11-X11R7.1-1.0.1/include/X11/Xlib.h:3609: error: parse error before "_X_SENTINEL"
| /home/marc/openEmbedded/build/tmp/work/arm-linux/libx11-X11R7.1-1.0.1-r0/libX11-X11R7.1-1.0.1/include/X11/Xlib.h:3609: warning: type defaults to `int' in declaration of `_X_SENTINEL'
| /home/marc/openEmbedded/build/tmp/work/arm-linux/libx11-X11R7.1-1.0.1-r0/libX11-X11R7.1-1.0.1/include/X11/Xlib.h:3609: warning: function declaration isn't a prototype
| /home/marc/openEmbedded/build/tmp/work/arm-linux/libx11-X11R7.1-1.0.1-r0/libX11-X11R7.1-1.0.1/include/X11/Xlib.h:3609: warning: data definition has no type or storage class
| /home/marc/openEmbedded/build/tmp/work/arm-linux/libx11-X11R7.1-1.0.1-r0/libX11-X11R7.1-1.0.1/include/X11/Xlib.h:3841: error: parse error before "_X_SENTINEL"
| /home/marc/openEmbedded/build/tmp/work/arm-linux/libx11-X11R7.1-1.0.1-r0/libX11-X11R7.1-1.0.1/include/X11/Xlib.h:3841: warning: type defaults to `int' in declaration of `_X_SENTINEL'
| /home/marc/openEmbedded/build/tmp/work/arm-linux/libx11-X11R7.1-1.0.1-r0/libX11-X11R7.1-1.0.1/include/X11/Xlib.h:3841: warning: function declaration isn't a prototype
| /home/marc/openEmbedded/build/tmp/work/arm-linux/libx11-X11R7.1-1.0.1-r0/libX11-X11R7.1-1.0.1/include/X11/Xlib.h:3841: warning: data definition has no type or storage class
| /home/marc/openEmbedded/build/tmp/work/arm-linux/libx11-X11R7.1-1.0.1-r0/libX11-X11R7.1-1.0.1/include/X11/Xlib.h:3845: error: parse error before "_X_SENTINEL"
| /home/marc/openEmbedded/build/tmp/work/arm-linux/libx11-X11R7.1-1.0.1-r0/libX11-X11R7.1-1.0.1/include/X11/Xlib.h:3845: warning: type defaults to `int' in declaration of `_X_SENTINEL'
| /home/marc/openEmbedded/build/tmp/work/arm-linux/libx11-X11R7.1-1.0.1-r0/libX11-X11R7.1-1.0.1/include/X11/Xlib.h:3845: warning: function declaration isn't a prototype
| /home/marc/openEmbedded/build/tmp/work/arm-linux/libx11-X11R7.1-1.0.1-r0/libX11-X11R7.1-1.0.1/include/X11/Xlib.h:3845: warning: data definition has no type or storage class
| /home/marc/openEmbedded/build/tmp/work/arm-linux/libx11-X11R7.1-1.0.1-r0/libX11-X11R7.1-1.0.1/include/X11/Xlib.h:3857: error: parse error before "_X_SENTINEL"
| /home/marc/openEmbedded/build/tmp/work/arm-linux/libx11-X11R7.1-1.0.1-r0/libX11-X11R7.1-1.0.1/include/X11/Xlib.h:3857: warning: type defaults to `int' in declaration of `_X_SENTINEL'
| /home/marc/openEmbedded/build/tmp/work/arm-linux/libx11-X11R7.1-1.0.1-r0/libX11-X11R7.1-1.0.1/include/X11/Xlib.h:3857: warning: function declaration isn't a prototype
| /home/marc/openEmbedded/build/tmp/work/arm-linux/libx11-X11R7.1-1.0.1-r0/libX11-X11R7.1-1.0.1/include/X11/Xlib.h:3857: warning: data definition has no type or storage class
| /home/marc/openEmbedded/build/tmp/work/arm-linux/libx11-X11R7.1-1.0.1-r0/libX11-X11R7.1-1.0.1/include/X11/Xlib.h:3885: error: parse error before "_X_SENTINEL"
| /home/marc/openEmbedded/build/tmp/work/arm-linux/libx11-X11R7.1-1.0.1-r0/libX11-X11R7.1-1.0.1/include/X11/Xlib.h:3885: warning: type defaults to `int' in declaration of `_X_SENTINEL'
| /home/marc/openEmbedded/build/tmp/work/arm-linux/libx11-X11R7.1-1.0.1-r0/libX11-X11R7.1-1.0.1/include/X11/Xlib.h:3885: warning: function declaration isn't a prototype
| /home/marc/openEmbedded/build/tmp/work/arm-linux/libx11-X11R7.1-1.0.1-r0/libX11-X11R7.1-1.0.1/include/X11/Xlib.h:3885: warning: data definition has no type or storage class
| /home/marc/openEmbedded/build/tmp/work/arm-linux/libx11-X11R7.1-1.0.1-r0/libX11-X11R7.1-1.0.1/include/X11/Xlib.h:3889: error: parse error before "_X_SENTINEL"
| /home/marc/openEmbedded/build/tmp/work/arm-linux/libx11-X11R7.1-1.0.1-r0/libX11-X11R7.1-1.0.1/include/X11/Xlib.h:3889: warning: type defaults to `int' in declaration of `_X_SENTINEL'
| /home/marc/openEmbedded/build/tmp/work/arm-linux/libx11-X11R7.1-1.0.1-r0/libX11-X11R7.1-1.0.1/include/X11/Xlib.h:3889: warning: function declaration isn't a prototype
| /home/marc/openEmbedded/build/tmp/work/arm-linux/libx11-X11R7.1-1.0.1-r0/libX11-X11R7.1-1.0.1/include/X11/Xlib.h:3889: warning: data definition has no type or storage class
| /home/marc/openEmbedded/build/tmp/work/arm-linux/libx11-X11R7.1-1.0.1-r0/libX11-X11R7.1-1.0.1/include/X11/Xlib.h:3929: error: parse error before "_X_SENTINEL"
| /home/marc/openEmbedded/build/tmp/work/arm-linux/libx11-X11R7.1-1.0.1-r0/libX11-X11R7.1-1.0.1/include/X11/Xlib.h:3929: warning: type defaults to `int' in declaration of `_X_SENTINEL'
| /home/marc/openEmbedded/build/tmp/work/arm-linux/libx11-X11R7.1-1.0.1-r0/libX11-X11R7.1-1.0.1/include/X11/Xlib.h:3929: warning: function declaration isn't a prototype
| /home/marc/openEmbedded/build/tmp/work/arm-linux/libx11-X11R7.1-1.0.1-r0/libX11-X11R7.1-1.0.1/include/X11/Xlib.h:3929: warning: data definition has no type or storage class
| make[3]: *** [imCallbk.lo] Error 1
| make[3]: Leaving directory `/home/marc/openEmbedded/build/tmp/work/arm-linux/libx11-X11R7.1-1.0.1-r0/libX11-X11R7.1-1.0.1/modules/im/ximcp'
| make[2]: *** [all-recursive] Error 1
| make[2]: Leaving directory `/home/marc/openEmbedded/build/tmp/work/arm-linux/libx11-X11R7.1-1.0.1-r0/libX11-X11R7.1-1.0.1/modules/im'
| make[1]: *** [all-recursive] Error 1
| make[1]: Leaving directory `/home/marc/openEmbedded/build/tmp/work/arm-linux/libx11-X11R7.1-1.0.1-r0/libX11-X11R7.1-1.0.1/modules'
| make: *** [all-recursive] Error 1
| FATAL: oe_runmake failed
NOTE: Task failed: /home/marc/openEmbedded/build/tmp/work/arm-linux/libx11-X11R7.1-1.0.1-r0/temp/log.do_compile.19077
NOTE: package libx11-X11R7.1-1.0.1-r0: task do_compile: failed
ERROR: TaskFailed event exception, aborting
NOTE: package libx11-X11R7.1-1.0.1: failed
ERROR: Build of gpe-image failed
Last Visitors
bowerymarc has no visitors to display.

Comments
Other users have left no comments for bowerymarc.

Friends
There are no friends to display.
RSS Lo-Fi Version Time is now: 18th September 2014 - 01:49 PM