OESF | ELSI | pdaXrom | OpenZaurus | Zaurus Themes | Community Links | Ibiblio

IPB

Welcome Guest ( Log In | Register )

Profile
Personal Photo
Options
Options
Personal Statement
lixiaosan doesn't have a personal statement currently.
Personal Info
lixiaosan
Age Unknown
Gender Not Set
Location Unknown
Birthday Unknown
Interests
No Information
Statistics
Joined: 20-March 05
Profile Views: 159*
Last Seen: 31st May 2005 - 07:53 PM
Local Time: Sep 18 2014, 03:38 AM
4 posts (0 per day)
Contact Information
AIM No Information
Yahoo No Information
ICQ No Information
MSN No Information
* Profile views updated each hour

lixiaosan

Members


Topics
Posts
Comments
Friends
My Content
12 May 2005
In local.conf ,we find word “virtual”。
for example:

ASSUME_PROVIDED = "virtual/${TARGET_PREFIX}gcc virtual/libc"

and use "bitbake virtual/kernel“ to build a kernel。

what about these ”virtual“ mean?
30 Mar 2005
when I use "bitbake bootstrap-image", I get error like this:

NOTE: package ipkg-utils-native-1.6cvs20050330: started
NOTE: package ipkg-utils-native-1.6cvs20050330-r4: task do_fetch: started
NOTE: package ipkg-utils-native-1.6cvs20050330-r4: task do_fetch: completed
NOTE: package ipkg-utils-native-1.6cvs20050330-r4: task do_patch: started
NOTE: Applying patch 'fix-ipkg-link'
ERROR: function do_patchcmd failed
ERROR: log data follows (/stuff/openembedded/tmp/work/ipkg-utils-native-1.6cvs20050330-r4/temp/log.do_patchcmd.20338)
| Replacing patch fix-ipkg-link with new version
| Applying patch fix-ipkg-link
| patching file ipkg-link
| Hunk #1 FAILED at 18.
| Hunk #2 FAILED at 48.
| Hunk #3 FAILED at 57.
| 3 out of 3 hunks FAILED -- rejects in file ipkg-link
| Patch fix-ipkg-link does not apply (enforce with -f)
NOTE: Task failed:
NOTE: package ipkg-utils-native-1.6cvs20050330-r4: task do_patch: failed
ERROR: TaskFailed event exception, aborting
NOTE: package ipkg-utils-native-1.6cvs20050330: failed
ERROR: Build of bootstrap-image failed

what 's wrong with the patch file or some other error ?
20 Mar 2005
on my rh8.0, I used "bitbake virtual/kernel" to build kernel .

below is the output.

OE Build Configuration:
TARGET_ARCH = "i386"
TARGET_OS = "linux"
MACHINE = "x86-uml"
DISTRO = ""
TARGET_FPU = ""

NOTE: package linux-uml-2.6.11-rc2-mm1: started
NOTE: package linux-uml-2.6.11-rc2-mm1-r3: task do_fetch: started
NOTE: package linux-uml-2.6.11-rc2-mm1-r3: task do_fetch: completed
NOTE: package linux-uml-2.6.11-rc2-mm1-r3: task do_patch: started
ERROR: function do_patchcleancmd failed
ERROR: log data follows (/stuff/openembedded/tmp/work/linux-uml-2.6.11-rc2-mm1-r3/temp/log.do_patchcleancmd.1816)
| /stuff/openembedded/tmp/work/linux-uml-2.6.11-rc2-mm1-r3/temp/run.do_patchcleancmd.1816: line 275: syntax error near unexpected token `'INHIBIT_PACKAGE_STRIP','
NOTE: Task failed:
NOTE: package linux-uml-2.6.11-rc2-mm1-r3: task do_patch: failed
ERROR: TaskFailed event exception, aborting
NOTE: package linux-uml-2.6.11-rc2-mm1: failed
ERROR: Build of virtual/kernel failed


who can tell me how to figure it out?Thanks!
Last Visitors
lixiaosan has no visitors to display.

Comments
Other users have left no comments for lixiaosan.

Friends
There are no friends to display.
RSS Lo-Fi Version Time is now: 18th September 2014 - 03:38 AM