OESF | ELSI | pdaXrom | OpenZaurus | Zaurus Themes | Community Links | Ibiblio

IPB

Welcome Guest ( Log In | Register )

Profile
Personal Photo
Options
Options
Personal Statement
deadite66 doesn't have a personal statement currently.
Personal Info
deadite66
Age Unknown
Male
Great Yarmouth, UK
Birthday Unknown
Interests
No Information
Statistics
Joined: 31-December 06
Profile Views: 837*
Last Seen: 6th June 2009 - 02:22 AM
Local Time: Oct 26 2014, 03:59 AM
29 posts (0 per day)
Contact Information
AIM No Information
Yahoo No Information
ICQ No Information
MSN No Information
Contact Private
* Profile views updated each hour

deadite66

Members


Topics
Posts
Comments
Friends
My Content
16 Feb 2008
been trying all morning to get this to work but no luck
host machine is ubuntu gutsy x86
target is Zaurus C3200 spitz

CODE
moon@sakura:~/OE/build$ bitbake base-image
NOTE: Handling BitBake files: \ (4965/4965) [100 %]
NOTE: Parsing finished. 4739 cached, 0 parsed, 226 skipped, 0 masked.
NOTE: build 200802161508: started

OE Build Configuration:
BB_VERSION     = "1.8.8"
OE_REVISION    = "ae6e884558b73791ef6c6aa8d6c2dff00277dfdc"
TARGET_ARCH    = "arm"
TARGET_OS      = "linux-gnueabi"
MACHINE        = "spitz"
DISTRO         = "angstrom"
DISTRO_VERSION = "2007.12-r4"
TARGET_FPU     = "soft"

NOTE: Resolving missing task queue dependencies
NOTE: Preparing runqueue
NOTE: Executing runqueue
NOTE: Running task 190 of 1353 (ID: 1027, /home/moon/OE/org.openembedded.angstrom-2007.12-stable/packages/glib-2.0/glib-2.0-native_2.12.4.bb, do_compile)
NOTE: Running task 191 of 1353 (ID: 922, /home/moon/OE/org.openembedded.angstrom-2007.12-stable/packages/python/python-native_2.5.1.bb, do_patch)
NOTE: package glib-2.0-native-2.12.4: started
NOTE: package glib-2.0-native-2.12.4-r1: task do_compile: started
NOTE: package python-native-2.5.1: started
NOTE: package python-native-2.5.1-ml1: task do_patch: started
NOTE: Applying patch 'bindir-libdir.patch'
NOTE: Applying patch 'cross-distutils.patch'
ERROR: function do_compile failed
ERROR: log data follows (/home/moon/OE/build/tmp/angstrom/work/i686-linux/glib-2.0-native-2.12.4-r1/temp/log.do_compile.27152)
| NOTE: make -j4
| make  all-recursive
| make[1]: Entering directory `/home/moon/OE/build/tmp/angstrom/work/i686-linux/glib-2.0-native-2.12.4-r1/glib-2.12.4'
| Making all in .
| make[2]: Entering directory `/home/moon/OE/build/tmp/angstrom/work/i686-linux/glib-2.0-native-2.12.4-r1/glib-2.12.4'
| make[2]: Nothing to be done for `all-am'.
| make[2]: Leaving directory `/home/moon/OE/build/tmp/angstrom/work/i686-linux/glib-2.0-native-2.12.4-r1/glib-2.12.4'
| Making all in m4macros
| make[2]: Entering directory `/home/moon/OE/build/tmp/angstrom/work/i686-linux/glib-2.0-native-2.12.4-r1/glib-2.12.4/m4macros'
| make[2]: Nothing to be done for `all'.
| make[2]: Leaving directory `/home/moon/OE/build/tmp/angstrom/work/i686-linux/glib-2.0-native-2.12.4-r1/glib-2.12.4/m4macros'
| Making all in glib
| make[2]: Entering directory `/home/moon/OE/build/tmp/angstrom/work/i686-linux/glib-2.0-native-2.12.4-r1/glib-2.12.4/glib'
| make  all-recursive
| make[3]: Entering directory `/home/moon/OE/build/tmp/angstrom/work/i686-linux/glib-2.0-native-2.12.4-r1/glib-2.12.4/glib'
| Making all in libcharset
| make[4]: Entering directory `/home/moon/OE/build/tmp/angstrom/work/i686-linux/glib-2.0-native-2.12.4-r1/glib-2.12.4/glib/libcharset'
| make[4]: Nothing to be done for `all'.
| make[4]: Leaving directory `/home/moon/OE/build/tmp/angstrom/work/i686-linux/glib-2.0-native-2.12.4-r1/glib-2.12.4/glib/libcharset'
| make[4]: Entering directory `/home/moon/OE/build/tmp/angstrom/work/i686-linux/glib-2.0-native-2.12.4-r1/glib-2.12.4/glib'
| if /bin/bash ../i686-linux-libtool --tag=CC --mode=compile gcc -DHAVE_CONFIG_H -I. -I. -I.. -I.. -DG_LOG_DOMAIN=\"GLib\" -DG_DISABLE_CAST_CHECKS -DG_DISABLE_ASSERT -DG_DISABLE_CHECKS -DG_DISABLE_DEPRECATED -DGLIB_COMPILATION   -isystem/home/moon/OE/build/tmp/angstrom/staging/i686-linux/include -pthread  -isystem/home/moon/OE/build/tmp/angstrom/staging/i686-linux/include -Os -Wall -MT gconvert.lo -MD -MP -MF ".deps/gconvert.Tpo" -c -o gconvert.lo gconvert.c; \
|       then mv -f ".deps/gconvert.Tpo" ".deps/gconvert.Plo"; else rm -f ".deps/gconvert.Tpo"; exit 1; fi
|  gcc -DHAVE_CONFIG_H -I. -I. -I.. -I.. -DG_LOG_DOMAIN=\"GLib\" -DG_DISABLE_CAST_CHECKS -DG_DISABLE_ASSERT -DG_DISABLE_CHECKS -DG_DISABLE_DEPRECATED -DGLIB_COMPILATION -isystem/home/moon/OE/build/tmp/angstrom/staging/i686-linux/include -pthread -isystem/home/moon/OE/build/tmp/angstrom/staging/i686-linux/include -Os -Wall -MT gconvert.lo -MD -MP -MF .deps/gconvert.Tpo -c gconvert.c  -fPIC -DPIC -o .libs/gconvert.o
| gconvert.c:48:2: error: #error GNU libiconv not in use but included iconv.h is from libiconv
| gconvert.c:92: warning: 'visibility' attribute ignored on non-class types
| make[4]: *** [gconvert.lo] Error 1
| make[4]: Leaving directory `/home/moon/OE/build/tmp/angstrom/work/i686-linux/glib-2.0-native-2.12.4-r1/glib-2.12.4/glib'
| make[3]: *** [all-recursive] Error 1
| make[3]: Leaving directory `/home/moon/OE/build/tmp/angstrom/work/i686-linux/glib-2.0-native-2.12.4-r1/glib-2.12.4/glib'
| make[2]: *** [all] Error 2
| make[2]: Leaving directory `/home/moon/OE/build/tmp/angstrom/work/i686-linux/glib-2.0-native-2.12.4-r1/glib-2.12.4/glib'
| make[1]: *** [all-recursive] Error 1
| make[1]: Leaving directory `/home/moon/OE/build/tmp/angstrom/work/i686-linux/glib-2.0-native-2.12.4-r1/glib-2.12.4'
| make: *** [all] Error 2
| FATAL: oe_runmake failed
NOTE: Task failed: /home/moon/OE/build/tmp/angstrom/work/i686-linux/glib-2.0-native-2.12.4-r1/temp/log.do_compile.27152
NOTE: package glib-2.0-native-2.12.4-r1: task do_compile: failed
ERROR: TaskFailed event exception, aborting
NOTE: package glib-2.0-native-2.12.4: failed
ERROR: Build of /home/moon/OE/org.openembedded.angstrom-2007.12-stable/packages/glib-2.0/glib-2.0-native_2.12.4.bb do_compile failed
ERROR: Task 1027 (/home/moon/OE/org.openembedded.angstrom-2007.12-stable/packages/glib-2.0/glib-2.0-native_2.12.4.bb, do_compile) failed
NOTE: Waiting for 1 active tasks to finish
NOTE: 1: /home/moon/OE/org.openembedded.angstrom-2007.12-stable/packages/python/python-native_2.5.1.bb, do_patch (27153)
NOTE: Applying patch 'dont-modify-shebang-line.patch'
NOTE: Applying patch 'default-is-optimized.patch'
NOTE: package python-native-2.5.1-ml1: task do_patch: completed
NOTE: package python-native-2.5.1: completed
NOTE: Tasks Summary: Attempted 189 tasks of which 189 didn't need to be rerun and 1 failed.
ERROR: '/home/moon/OE/org.openembedded.angstrom-2007.12-stable/packages/glib-2.0/glib-2.0-native_2.12.4.bb' failed
moon@sakura:~/OE/build$


any ideas?
25 Jan 2008
thinking of trying Angstrom.
any spitz owners have any opinion on the state of it atm compared to pdaXrom?
10 Mar 2007
is it possible to set up a client on my c3200?
15 Jan 2007
running cacko 1.23 on a C3200

is it usual for a usb bluetooth dongle to max out the cpu?, its maxed out even on turbo.

is CF BT adaptor any different?


QUOTE
hci_usb
Speed: 12Mb/s (full)
USB Version: 1.10
Device Class: e0(unk. )
Device Subclass: 01
Device Protocol: 01
Maximum Default Endpoint Size: 64
Number of Configurations: 1
Vendor Id: Belkin Components (0x50d)
Product Id: (0x84)
Revision Number: 5.25

Attached File(s)
Attached File  belkin_bt_usb.txt ( 3.03K ) Number of downloads: 16
 
4 Jan 2007
got a new C3200 from figlabs yesterday.
on startup i got "error!! HDD not initialized!" :<
so then did the reset to factory defaults and restored to english text.
problem is i get the HDD error every time i reboot the device.

hardware problem?
Last Visitors


10 Jan 2011 - 22:24


2 Apr 2008 - 21:43

Comments
Other users have left no comments for deadite66.

Friends
There are no friends to display.
RSS Lo-Fi Version Time is now: 25th October 2014 - 06:59 PM